Target
Large T antigen
Ligand
BDBM59015
Substrate
Meas. Tech.
Identification of SV40 T antigen inhibitors: Cytotoxicity screen of selected hits
EC50
32480±n/a nM
Citation
 PubChem, PC Identification of SV40 T antigen inhibitors: Cytotoxicity screen of selected hits PubChem Bioassay (2009)[AID] 
Target
Name:
Large T antigen
Synonyms:
LT LT_SV40
Type:
Enzyme Catalytic Domain
Mol. Mass.:
81575.54
Organism:
Simian virus 40
Description:
P03070
Residue:
708
  
Inhibitor
Name:
BDBM59015
Synonyms:
3-allyl-5-(2-furyl)-2-thioxo-1H-thieno[2,3-d]pyrimidin-4-one 5-(furan-2-yl)-3-prop-2-enyl-2-sulfanylidene-1H-thieno[2,3-d]pyrimidin-4-one SMR000353386 | cid_764734
Type:
Small organic molecule
Emp. Form.:
C13H10N2O2S2
Mol. Mass.:
290.361
SMILES:
C=CCn1c(=S)[nH]c2scc(-c3ccco3)c2c1=O
: