Target
Alkaline phosphatase, germ cell type
Ligand
BDBM39682
Substrate
Meas. Tech.
Luminescent assay for HTS discovery of chemical activators of placental alkaline phosphatase
EC50
21400±n/a nM
Citation
 PubChem, PC Luminescent assay for HTS discovery of chemical activators of placental alkaline phosphatase PubChem Bioassay (2007)[AID] 
Target
Name:
Alkaline phosphatase, germ cell type
Synonyms:
ALPG ALPPL2 PPBN_HUMAN | placental-like alkaline phosphatase preproprotein
Type:
PROTEIN
Mol. Mass.:
57374.31
Organism:
Homo sapiens (Human)
Description:
ChEMBL_29964
Residue:
532
  
Inhibitor
Name:
BDBM39682
Synonyms:
2-[(5-keto-3-thioxo-2H-1,2,4-triazin-6-yl)amino]propionic acid butyl ester MLS000530277 butyl 2-[(5-oxidanylidene-3-sulfanylidene-2H-1,2,4-triazin-6-yl)amino]propanoate butyl N-(5-oxo-3-thioxo-2,3,4,5-tetrahydro-1,2,4-triazin-6-yl)alaninate | cid_2729311
Type:
Small organic molecule
Emp. Form.:
C10H16N4O3S
Mol. Mass.:
272.324
SMILES:
CCCCOC(=O)C(C)Nc1n[nH]c(=S)[nH]c1=O
: