Target
E3 ubiquitin-protein ligase XIAP
Ligand
BDBM59426
Substrate
Meas. Tech.
Chemical Antagonists IAP-family anti-apoptotic proteins
IC50
100000±n/a nM
Citation
 PubChem, PC Chemical Antagonists IAP-family anti-apoptotic proteins PubChem Bioassay (2008)[AID] 
Target
Name:
E3 ubiquitin-protein ligase XIAP
Synonyms:
API3 E3 ubiquitin-protein ligase XIAP Inhibitor of apoptosis protein 3 X-linked inhibitor of apoptosis XIAP | XIAP_HUMAN
Type:
Protein
Mol. Mass.:
56685.27
Organism:
Homo sapiens (Human)
Description:
P98170
Residue:
497
  
Inhibitor
Name:
BDBM59426
Synonyms:
2-(2-amino-5-cyano-6-methylsulfanylpyrimidin-4-yl)sulfanyl-N-(3-fluorophenyl)acetamide 2-[[2-amino-5-cyano-6-(methylthio)-4-pyrimidinyl]thio]-N-(3-fluorophenyl)acetamide 2-{[2-amino-5-cyano-6-(methylthio)-4-pyrimidinyl]thio}-N-(3-fluorophenyl)acetamide SMR000200433 | cid_1611923
Type:
Small organic molecule
Emp. Form.:
C14H12FN5OS2
Mol. Mass.:
349.406
SMILES:
CSc1nc(N)nc(SCC(=O)Nc2cccc(F)c2)c1C#N
: