Target
M17 leucyl aminopeptidase
Ligand
BDBM59729
Substrate
Meas. Tech.
Inhibitors of Plasmodium falciparum M17- Family Leucine Aminopeptidase (M17LAP)
IC50
13350±n/a nM
Citation
 PubChem, PC Inhibitors of Plasmodium falciparum M17- Family Leucine Aminopeptidase (M17LAP) PubChem Bioassay (2009)[AID] 
Target
Name:
M17 leucyl aminopeptidase
Synonyms:
leucine aminopeptidase
Type:
Enzyme Catalytic Domain
Mol. Mass.:
67834.32
Organism:
Plasmodium falciparum 3D7
Description:
gi_124809582
Residue:
605
  
Inhibitor
Name:
BDBM59729
Synonyms:
1-(1,3-benzodioxol-5-yl)-3-[4-[(5-methyl-1,2-oxazol-3-yl)sulfamoyl]phenyl]urea 1-(1,3-benzodioxol-5-yl)-3-[4-[(5-methylisoxazol-3-yl)sulfamoyl]phenyl]urea MLS000051690 cid_1245729
Type:
Small organic molecule
Emp. Form.:
C18H16N4O6S
Mol. Mass.:
416.408
SMILES:
Cc1cc(NS(=O)(=O)c2ccc(NC(=O)Nc3ccc4OCOc4c3)cc2)no1
: