Target
M17 leucyl aminopeptidase
Ligand
BDBM60041
Substrate
Meas. Tech.
Inhibitors of Plasmodium falciparum M17- Family Leucine Aminopeptidase (M17LAP)
IC50
1220±n/a nM
Citation
 PubChem, PC Inhibitors of Plasmodium falciparum M17- Family Leucine Aminopeptidase (M17LAP) PubChem Bioassay (2009)[AID] 
Target
Name:
M17 leucyl aminopeptidase
Synonyms:
leucine aminopeptidase
Type:
Enzyme Catalytic Domain
Mol. Mass.:
67834.32
Organism:
Plasmodium falciparum 3D7
Description:
gi_124809582
Residue:
605
  
Inhibitor
Name:
BDBM60041
Synonyms:
2-keto-1H-pyridine-3-carboxylic acid [2-[2,5-dimethyl-1-(p-tolyl)pyrrol-3-yl]-2-keto-ethyl] ester MLS000416852 [2-[2,5-dimethyl-1-(4-methylphenyl)pyrrol-3-yl]-2-oxidanylidene-ethyl] 2-oxidanylidene-1H-pyridine-3-carboxylate cid_2534595
Type:
Small organic molecule
Emp. Form.:
C21H20N2O4
Mol. Mass.:
364.3945
SMILES:
Cc1cc(C(=O)COC(=O)c2ccc[nH]c2=O)c(C)n1-c1ccc(C)cc1
: