Target
Voltage-dependent N-type calcium channel subunit alpha-1B
Ligand
BDBM40956
Substrate
Meas. Tech.
Homogeneous Time-Resolved Fluorescence Resonance Energy Transfer (HTRF) Assay
IC50
3780±n/a nM
Citation
 PubChem, PC Homogeneous Time-Resolved Fluorescence Resonance Energy Transfer (HTRF) Assay PubChem Bioassay (2009)[AID] 
Target
Name:
Voltage-dependent N-type calcium channel subunit alpha-1B
Synonyms:
BIII CAC1B_HUMAN CACNA1B Calcium channel (Type N) Voltage-dependent N-type calcium channel subunit alpha-1B Voltage-gated N-type calcium channel alpha-1B subunit Voltage-gated calcium channel Voltage-gated calcium channel subunit alpha Cav2.2 ((alpha 1B, beta 1b, alpha 2 delta-1) | calcium channel, voltage-dependent, N type, alpha 1B subunit
Type:
Enzyme
Mol. Mass.:
262548.16
Organism:
Homo sapiens (Human)
Description:
Q00975
Residue:
2339
  
Inhibitor
Name:
BDBM40956
Synonyms:
1-[2-[4-(4-chlorobenzyl)oxyphenyl]-4-cyano-oxazol-5-yl]isonipecotamide 1-[2-[4-[(4-chlorophenyl)methoxy]phenyl]-4-cyano-5-oxazolyl]-4-piperidinecarboxamide SMR000044900 | cid_664100
Type:
Small organic molecule
Emp. Form.:
C23H21ClN4O3
Mol. Mass.:
436.891
SMILES:
NC(=O)C1CCN(CC1)c1oc(nc1C#N)-c1ccc(OCc2ccc(Cl)cc2)cc1
: