Target
Bcl-2-like protein 1
Ligand
BDBM34716
Substrate
Meas. Tech.
Counterscreen for inhibitors of MCL1: fluorescence polarization-based biochemical high throughput dose response assay for inhibitors of BCL2-related protein, long isoform (BCLXL).
IC50
68732±n/a nM
Citation
 PubChem, PC Counterscreen for inhibitors of MCL1: fluorescence polarization-based biochemical high throughput dose response assay for inhibitors of BCL2-related protein, long isoform (BCLXL). PubChem Bioassay (2009)[AID] 
Target
Name:
Bcl-2-like protein 1
Synonyms:
Anti-apoptotic Bcl-2 protein Apoptosis regulator Bcl-X BCL2-like 1 isoform 1 BCL2L1 Bcl-2-like protein 1 (Bcl-XL) Bcl-xL/Bcl-2-binding component 3 Bcl2-antagonist of cell death (BAD)
Type:
Mitochondrion membrane; Single-pass membrane protein
Mol. Mass.:
26039.60
Organism:
Homo sapiens (Human)
Description:
Residue:
233
  
Inhibitor
Name:
BDBM34716
Synonyms:
(4Z)-4-[3-(2-furanyl)-5H-[1,2,4]triazolo[3,4-b][1,3,4]thiadiazin-6-ylidene]-2-hydroxy-1-cyclohexa-2,5-dienone (4Z)-4-[3-(furan-2-yl)-5H-[1,2,4]triazolo[3,4-b][1,3,4]thiadiazin-6-ylidene]-2-hydroxycyclohexa-2,5-dien-1-one 4-(3-Furan-2-yl-7H-[1,2,4]triazolo[3,4-b][1,3,4]thiadiazin-6-yl)-benzene-1,2-diol SMR000145487 | cid_5929242
Type:
Small organic molecule
Emp. Form.:
C14H10N4O3S
Mol. Mass.:
314.319
SMILES:
Oc1ccc(cc1O)C1=Nn2c(SC1)nnc2-c1ccco1
: