Target
Bcl-2-like protein 1
Ligand
BDBM50667
Substrate
Meas. Tech.
Counterscreen for inhibitors of MCL1: fluorescence polarization-based biochemical high throughput dose response assay for inhibitors of BCL2-related protein, long isoform (BCLXL).
IC50
108803±n/a nM
Citation
 PubChem, PC Counterscreen for inhibitors of MCL1: fluorescence polarization-based biochemical high throughput dose response assay for inhibitors of BCL2-related protein, long isoform (BCLXL). PubChem Bioassay (2009)[AID] 
Target
Name:
Bcl-2-like protein 1
Synonyms:
Anti-apoptotic Bcl-2 protein Apoptosis regulator Bcl-X BCL2-like 1 isoform 1 BCL2L1 Bcl-2-like protein 1 (Bcl-XL) Bcl-xL/Bcl-2-binding component 3 Bcl2-antagonist of cell death (BAD)
Type:
Mitochondrion membrane; Single-pass membrane protein
Mol. Mass.:
26039.60
Organism:
Homo sapiens (Human)
Description:
Residue:
233
  
Inhibitor
Name:
BDBM50667
Synonyms:
1-(2-chloranyl-5-morpholin-4-ylsulfonyl-phenyl)-3-[[(E)-(3-chloranyl-5-nitro-6-oxidanylidene-cyclohexa-2,4-dien-1-ylidene)methyl]amino]thiourea 1-[2-chloro-5-(4-morpholinylsulfonyl)phenyl]-3-[[(E)-(3-chloro-5-nitro-6-oxo-1-cyclohexa-2,4-dienylidene)methyl]amino]thiourea MLS000760375 cid_6301191
Type:
Small organic molecule
Emp. Form.:
C18H17Cl2N5O6S2
Mol. Mass.:
534.393
SMILES:
[O-][N+](=O)c1cc(Cl)c[c-](C=[NH+]NC(=S)Nc2cc(ccc2Cl)S(=O)(=O)N2CCOCC2)c1=O
: