Target
Bcl-2-like protein 1
Ligand
BDBM53267
Substrate
Meas. Tech.
Counterscreen for inhibitors of MCL1: fluorescence polarization-based biochemical high throughput dose response assay for inhibitors of BCL2-related protein, long isoform (BCLXL).
IC50
103947±n/a nM
Citation
 PubChem, PC Counterscreen for inhibitors of MCL1: fluorescence polarization-based biochemical high throughput dose response assay for inhibitors of BCL2-related protein, long isoform (BCLXL). PubChem Bioassay (2009)[AID] 
Target
Name:
Bcl-2-like protein 1
Synonyms:
Anti-apoptotic Bcl-2 protein Apoptosis regulator Bcl-X BCL2-like 1 isoform 1 BCL2L1 Bcl-2-like protein 1 (Bcl-XL) Bcl-xL/Bcl-2-binding component 3 Bcl2-antagonist of cell death (BAD)
Type:
Mitochondrion membrane; Single-pass membrane protein
Mol. Mass.:
26039.60
Organism:
Homo sapiens (Human)
Description:
Residue:
233
  
Inhibitor
Name:
BDBM53267
Synonyms:
4-[2-[(E)-[2,4-bis(oxidanylidene)-3-(2-oxidanylidene-2-pyrrolidin-1-yl-ethyl)-1,3-thiazolidin-5-ylidene]methyl]pyrrol-1-yl]benzoic acid 4-[2-[(E)-[2,4-dioxo-3-(2-oxo-2-pyrrolidin-1-ylethyl)-1,3-thiazolidin-5-ylidene]methyl]pyrrol-1-yl]benzoic acid 4-{2-[2,4-Dioxo-3-(2-oxo-2-pyrrolidin-1-yl-ethyl)-thiazolidin-(5E)-ylidenemethyl]-pyrrol-1-yl}-benzoic acid SMR000605630 | cid_6490291
Type:
Small organic molecule
Emp. Form.:
C21H19N3O5S
Mol. Mass.:
425.458
SMILES:
OC(=O)c1ccc(cc1)-n1cccc1\C=C1\SC(=O)N(CC(=O)N2CCCC2)C1=O
: