Target
Fibroblast growth factor receptor 4
Ligand
BDBM103869
Substrate
Meas. Tech.
FGFR-4 wild type assay at Km
pH
7.5±n/a
Temperature
298.15±n/a K
IC50
<10.00±n/a nM
Comments
extracted
Citation
 Bifulco, Jr., NDiPietro, LVMiduturu, CV Inhibitors of the fibroblast growth factor receptor US Patent  US9695165 Publication Date 7/4/2017 
Target
Name:
Fibroblast growth factor receptor 4
Synonyms:
CD_antigen: CD334 FGFR4 FGFR4 Fibroblast growth factor receptor JK2 TKF
Type:
Protein
Mol. Mass.:
87957.45
Organism:
Homo sapiens (Human)
Description:
P22455
Residue:
802
  
Inhibitor
Name:
BDBM103869
Synonyms:
US9695165, 52
Type:
Small organic molecule
Emp. Form.:
C31H29Cl2N3O5
Mol. Mass.:
594.485
SMILES:
CCn1c2cc(ncc2cc(-c2c(Cl)c(OC)cc(OC)c2Cl)c1=O)-c1ccc2OC(C)(C)CN(C(=O)C=C)c2c1
: