Target
Regulator of G-protein signaling 4
Ligand
BDBM46667
Substrate
Meas. Tech.
Dose response, multiplexed high-throughput screen for small molecule regulators of RGS family protein interactions, specifically RGS4-Galphao for SAR compounds
EC50
135±n/a nM
Citation
 PubChem, PC Dose response, multiplexed high-throughput screen for small molecule regulators of RGS family protein interactions, specifically RGS4-Galphao for SAR compounds PubChem Bioassay (2010)[AID] 
Target
Name:
Regulator of G-protein signaling 4
Synonyms:
RGP4 RGS4_HUMAN | Regulator of G-protein signaling 4 (RGS4)
Type:
Enzyme
Mol. Mass.:
23263.51
Organism:
Homo sapiens (Human)
Description:
P49798
Residue:
205
  
Inhibitor
Name:
BDBM46667
Synonyms:
2-phenyl-1,2-benzothiazol-3-one MLS-0107957.0001 cid_164981
Type:
Small organic molecule
Emp. Form.:
C13H9NOS
Mol. Mass.:
227.282
SMILES:
O=c1n(sc2ccccc12)-c1ccccc1
: