Target
Regulator of G-protein signaling 8
Ligand
BDBM47770
Substrate
Meas. Tech.
Dose response, multiplexed high-throughput screen for small molecule regulators of RGS family protein interactions, specifically RGS8-Galphao for SAR Compounds
EC50
701±n/a nM
Citation
 PubChem, PC Dose response, multiplexed high-throughput screen for small molecule regulators of RGS family protein interactions, specifically RGS8-Galphao for SAR Compounds PubChem Bioassay (2010)[AID] 
Target
Name:
Regulator of G-protein signaling 8
Synonyms:
RGS8 Regulator of G-protein signaling 8 (RGS8)
Type:
Enzyme Catalytic Domain
Mol. Mass.:
20925.80
Organism:
Homo sapiens (Human)
Description:
gi_74355113
Residue:
180
  
Inhibitor
Name:
BDBM47770
Synonyms:
4-[5-[(2,2-dimethyl-4,6-dioxo-1,3-dioxan-5-ylidene)methyl]-2-furanyl]benzenesulfonamide 4-[5-[(4,6-diketo-2,2-dimethyl-1,3-dioxan-5-ylidene)methyl]-2-furyl]benzenesulfonamide MLS000703574 cid_1154580
Type:
Small organic molecule
Emp. Form.:
C17H15NO7S
Mol. Mass.:
377.369
SMILES:
[#6]C1([#6])[#8]-[#6](=O)\[#6](=[#6]/c2ccc(o2)-c2ccc(cc2)S([#7])(=O)=O)-[#6](=O)-[#8]1
: