Target
Heat shock factor protein 1
Ligand
BDBM52218
Substrate
Meas. Tech.
Luminescence Cell-Based Dose Confimation HTS to Identify Inhibitors of Heat Shock Factor 1 (HSF1)
EC50
>195000±0 nM
Citation
 PubChem, PC Luminescence Cell-Based Dose Confimation HTS to Identify Inhibitors of Heat Shock Factor 1 (HSF1) PubChem Bioassay (2010)[AID] 
Target
Name:
Heat shock factor protein 1
Synonyms:
HSF1_MOUSE Hsf1 protein
Type:
Enzyme Catalytic Domain
Mol. Mass.:
57208.68
Organism:
Mus musculus
Description:
P38532
Residue:
525
  
Inhibitor
Name:
BDBM52218
Synonyms:
2-amino-5-keto-7,7-dimethyl-4-phenyl-6,8-dihydro-4H-chromene-3-carbonitrile 2-amino-7,7-dimethyl-5-oxo-4-phenyl-6,8-dihydro-4H-chromene-3-carbonitrile MLS000105495 cid_2737879
Type:
Small organic molecule
Emp. Form.:
C18H18N2O2
Mol. Mass.:
294.3477
SMILES:
CC1(C)CC(=O)C2=C(C1)OC(=N)C(C#N)C2c1ccccc1
: