Target
G-protein coupled receptor 55
Ligand
BDBM61626
Substrate
Meas. Tech.
SAR Analysis of Selective Antagonists of GPR55 using an Image-Based Assay
IC50
>32000±n/a nM
Citation
 PubChem, PC SAR Analysis of Selective Antagonists of GPR55 using an Image-Based Assay PubChem Bioassay (2010)[AID] 
Target
Name:
G-protein coupled receptor 55
Synonyms:
G protein-coupled receptor 55 GPR55_HUMAN
Type:
PROTEIN
Mol. Mass.:
36649.72
Organism:
Homo sapiens (Human)
Description:
ChEMBL_1292265
Residue:
319
  
Inhibitor
Name:
BDBM61626
Synonyms:
MLS000777252 N-(4-hydroxyphenyl)-4-[(5Z)-4-keto-5-(4-methylbenzylidene)-2-thioxo-thiazolidin-3-yl]butyramide N-(4-hydroxyphenyl)-4-[(5Z)-5-[(4-methylphenyl)methylidene]-4-oxo-2-sulfanylidene-1,3-thiazolidin-3-yl]butanamide SMR000413647 | cid_1346847
Type:
Small organic molecule
Emp. Form.:
C21H20N2O3S2
Mol. Mass.:
412.525
SMILES:
Cc1ccc(\C=C2/SC(=S)N(CCCC(=O)Nc3ccc(O)cc3)C2=O)cc1
: