Target
Inward rectifier potassium channel 2
Ligand
BDBM65855
Substrate
Meas. Tech.
Confirmation dose response assay for compounds that inhibit/block inward-rectifying potassium ion channel Kir2.1
IC50
34042±92273 nM
Citation
 PubChem, PC Confirmation dose response assay for compounds that inhibit/block inward-rectifying potassium ion channel Kir2.1 PubChem Bioassay (2010)[AID] 
Target
Name:
Inward rectifier potassium channel 2
Synonyms:
Irk1 Kcnj2 | inward rectifier potassium channel 2
Type:
Enzyme Catalytic Domain
Mol. Mass.:
48383.35
Organism:
Mus musculus
Description:
gi_6680530
Residue:
428
  
Inhibitor
Name:
BDBM65855
Synonyms:
(4-methoxyphenyl)-(4-quinolyl)amine;hydrochloride N-(4-methoxyphenyl)-4-quinolinamine;hydrochloride SMR000033695 | cid_6602913
Type:
Small organic molecule
Emp. Form.:
C16H14N2O
Mol. Mass.:
250.2952
SMILES:
COc1ccc(Nc2ccnc3ccccc23)cc1
: