Target
Inward rectifier potassium channel 2
Ligand
BDBM65857
Substrate
Meas. Tech.
Confirmation dose response assay for compounds that inhibit/block inward-rectifying potassium ion channel Kir2.1
IC50
33528±15685 nM
Citation
 PubChem, PC Confirmation dose response assay for compounds that inhibit/block inward-rectifying potassium ion channel Kir2.1 PubChem Bioassay (2010)[AID] 
Target
Name:
Inward rectifier potassium channel 2
Synonyms:
Irk1 Kcnj2 | inward rectifier potassium channel 2
Type:
Enzyme Catalytic Domain
Mol. Mass.:
48383.35
Organism:
Mus musculus
Description:
gi_6680530
Residue:
428
  
Inhibitor
Name:
BDBM65857
Synonyms:
3-(4-benzoxyphenoxy)propyl-cyclopentyl-amine;oxalic acid N-{3-[4-(benzyloxy)phenoxy]propyl}cyclopentanamine oxalate cid_2948996 oxalic acid;N-[3-(4-phenylmethoxyphenoxy)propyl]cyclopentanamine
Type:
Small organic molecule
Emp. Form.:
C21H27NO2
Mol. Mass.:
325.4446
SMILES:
C(CNC1CCCC1)COc1ccc(OCc2ccccc2)cc1
: