Target
Inward rectifier potassium channel 2
Ligand
BDBM65860
Substrate
Meas. Tech.
Confirmation dose response assay for compounds that inhibit/block inward-rectifying potassium ion channel Kir2.1
IC50
43007±65846 nM
Citation
 PubChem, PC Confirmation dose response assay for compounds that inhibit/block inward-rectifying potassium ion channel Kir2.1 PubChem Bioassay (2010)[AID] 
Target
Name:
Inward rectifier potassium channel 2
Synonyms:
Irk1 Kcnj2 | inward rectifier potassium channel 2
Type:
Enzyme Catalytic Domain
Mol. Mass.:
48383.35
Organism:
Mus musculus
Description:
gi_6680530
Residue:
428
  
Inhibitor
Name:
BDBM65860
Synonyms:
4-(methylthio)-N-(1-phenylethyl)benzenesulfonamide MLS000693878 cid_2962951
Type:
Small organic molecule
Emp. Form.:
C15H17NO2S2
Mol. Mass.:
307.431
SMILES:
CSc1ccc(cc1)S(=O)(=O)NC(C)c1ccccc1
: