Target
Inward rectifier potassium channel 2
Ligand
BDBM65862
Substrate
Meas. Tech.
Confirmation dose response assay for compounds that inhibit/block inward-rectifying potassium ion channel Kir2.1
IC50
37580±39161 nM
Citation
 PubChem, PC Confirmation dose response assay for compounds that inhibit/block inward-rectifying potassium ion channel Kir2.1 PubChem Bioassay (2010)[AID] 
Target
Name:
Inward rectifier potassium channel 2
Synonyms:
Irk1 Kcnj2 | inward rectifier potassium channel 2
Type:
Enzyme Catalytic Domain
Mol. Mass.:
48383.35
Organism:
Mus musculus
Description:
gi_6680530
Residue:
428
  
Inhibitor
Name:
BDBM65862
Synonyms:
2-[(2,4-dichlorobenzylidene)amino]guanidine MLS001047467 cid_248400
Type:
Small organic molecule
Emp. Form.:
C8H8Cl2N4
Mol. Mass.:
231.082
SMILES:
[#7]\[#6](-[#7])=[#7]\[#7]=[#6]-c1ccc(Cl)cc1Cl
: