Target
Inward rectifier potassium channel 2
Ligand
BDBM65864
Substrate
Meas. Tech.
Confirmation dose response assay for compounds that inhibit/block inward-rectifying potassium ion channel Kir2.1
IC50
54213±38096 nM
Citation
 PubChem, PC Confirmation dose response assay for compounds that inhibit/block inward-rectifying potassium ion channel Kir2.1 PubChem Bioassay (2010)[AID] 
Target
Name:
Inward rectifier potassium channel 2
Synonyms:
Irk1 Kcnj2 | inward rectifier potassium channel 2
Type:
Enzyme Catalytic Domain
Mol. Mass.:
48383.35
Organism:
Mus musculus
Description:
gi_6680530
Residue:
428
  
Inhibitor
Name:
BDBM65864
Synonyms:
1-adamantyl-(1-propyl-4-piperidyl)amine N-(1-adamantyl)-1-propyl-4-piperidinamine N-(1-adamantyl)-1-propylpiperidin-4-amine SMR000496476 | cid_2846583
Type:
Small organic molecule
Emp. Form.:
C18H32N2
Mol. Mass.:
276.4601
SMILES:
[H]C12CC3([H])CC([H])(C1)CC(C2)(C3)NC1CCN(CCC)CC1
: