Target
Inward rectifier potassium channel 2
Ligand
BDBM65866
Substrate
Meas. Tech.
Confirmation dose response assay for compounds that inhibit/block inward-rectifying potassium ion channel Kir2.1
IC50
58513±14748 nM
Citation
 PubChem, PC Confirmation dose response assay for compounds that inhibit/block inward-rectifying potassium ion channel Kir2.1 PubChem Bioassay (2010)[AID] 
Target
Name:
Inward rectifier potassium channel 2
Synonyms:
Irk1 Kcnj2 | inward rectifier potassium channel 2
Type:
Enzyme Catalytic Domain
Mol. Mass.:
48383.35
Organism:
Mus musculus
Description:
gi_6680530
Residue:
428
  
Inhibitor
Name:
BDBM65866
Synonyms:
1-(4-Fluoro-benzenesulfonyl)-1,2,3,4-tetrahydro-quinoline MLS001207781 cid_767981
Type:
Small organic molecule
Emp. Form.:
C15H14FNO2S
Mol. Mass.:
291.341
SMILES:
Fc1ccc(cc1)S(=O)(=O)N1CCCc2ccccc12
: