Target
Inward rectifier potassium channel 2
Ligand
BDBM65868
Substrate
Meas. Tech.
Confirmation dose response assay for compounds that inhibit/block inward-rectifying potassium ion channel Kir2.1
IC50
25562±12588 nM
Citation
 PubChem, PC Confirmation dose response assay for compounds that inhibit/block inward-rectifying potassium ion channel Kir2.1 PubChem Bioassay (2010)[AID] 
Target
Name:
Inward rectifier potassium channel 2
Synonyms:
Irk1 Kcnj2 | inward rectifier potassium channel 2
Type:
Enzyme Catalytic Domain
Mol. Mass.:
48383.35
Organism:
Mus musculus
Description:
gi_6680530
Residue:
428
  
Inhibitor
Name:
BDBM65868
Synonyms:
4-Bromo-N-(1-phenyl-ethyl)-benzenesulfonamide 4-bromo-N-(1-phenylethyl)benzenesulfonamide SMR000516693 | cid_2841713
Type:
Small organic molecule
Emp. Form.:
C14H14BrNO2S
Mol. Mass.:
340.235
SMILES:
CC(NS(=O)(=O)c1ccc(Br)cc1)c1ccccc1
: