Target
Potassium voltage-gated channel subfamily KQT member 2
Ligand
BDBM48038
Substrate
Meas. Tech.
Mode of action assay-Automated electrophysiology assay of compounds that potentiate KCNQ2 potassium channel
EC50
9510±2200 nM
Citation
 PubChem, PC Mode of action assay-Automated electrophysiology assay of compounds that potentiate KCNQ2 potassium channel PubChem Bioassay (2010)[AID] 
Target
Name:
Potassium voltage-gated channel subfamily KQT member 2
Synonyms:
KCNQ2_RAT Voltage-gated potassium channel subunit Kv7.2 | potassium voltage-gated channel, KQT-like subfamily, member 2
Type:
PROTEIN
Mol. Mass.:
93984.01
Organism:
Rattus norvegicus
Description:
EBI_100117
Residue:
852
  
Inhibitor
Name:
BDBM48038
Synonyms:
4-[(E)-[3-(2-methylanilino)-4-oxo-1-naphthalenylidene]amino]sulfonylbenzoic acid 4-[(E)-[3-[(2-methylphenyl)amino]-4-oxidanylidene-naphthalen-1-ylidene]amino]sulfonylbenzoic acid MLS000948152 cid_6023693
Type:
Small organic molecule
Emp. Form.:
C24H18N2O5S
Mol. Mass.:
446.475
SMILES:
Cc1ccccc1NC1=CC(=NS(=O)(=O)c2ccc(cc2)C(O)=O)c2ccccc2C1=O
: