Target
Glycogen synthase kinase-3 beta
Ligand
BDBM58072
Substrate
Meas. Tech.
Luminescence Cell-Free Homogeneous Dose Retest to Identify Inhibitors of Glycogen Synthase Kinase-3 beta Activity
EC50
539.1±n/a nM
Citation
 PubChem, PC Luminescence Cell-Free Homogeneous Dose Retest to Identify Inhibitors of Glycogen Synthase Kinase-3 beta Activity PubChem Bioassay (2010)[AID] 
Target
Name:
Glycogen synthase kinase-3 beta
Synonyms:
GSK-3 beta GSK3B Glycogen synthase kinase 3 beta (GSK3B) Glycogen synthase kinase-3 beta (GSK-3B) Glycogen synthase kinase-3 beta (GSK3B) Glycogen synthase kinase-3beta (GSK3B) | Serine/threonine-protein kinase GSK3B
Type:
Enzyme
Mol. Mass.:
46756.38
Organism:
Homo sapiens (Human)
Description:
P49841
Residue:
420
  
Inhibitor
Name:
BDBM58072
Synonyms:
2-N-butan-2-yl-4-N-(2,5-dimethoxyphenyl)-5-nitropyrimidine-2,4,6-triamine N-sec-Butyl-N'-(2,5-dimethoxy-phenyl)-5-nitro-pyrimidine-2,4,6-triamine N2-butan-2-yl-N4-(2,5-dimethoxyphenyl)-5-nitropyrimidine-2,4,6-triamine [4-amino-6-(2,5-dimethoxyanilino)-5-nitro-pyrimidin-2-yl]-sec-butyl-amine | cid_3336201
Type:
Small organic molecule
Emp. Form.:
C16H22N6O4
Mol. Mass.:
362.3837
SMILES:
CCC(C)Nc1nc(N)c(c(Nc2cc(OC)ccc2OC)n1)[N+]([O-])=O
: