Target
Heat shock factor protein 1
Ligand
BDBM72328
Substrate
Meas. Tech.
Luminescence Cell-Based Dose Retest to Identify Potentiators of Heat Shock Factor 1 (HSF1)
EC50
>260000±n/a nM
Citation
 PubChem, PC Luminescence Cell-Based Dose Retest to Identify Potentiators of Heat Shock Factor 1 (HSF1) PubChem Bioassay (2010)[AID] 
Target
Name:
Heat shock factor protein 1
Synonyms:
HSF1_MOUSE Hsf1 protein
Type:
Enzyme Catalytic Domain
Mol. Mass.:
57208.68
Organism:
Mus musculus
Description:
P38532
Residue:
525
  
Inhibitor
Name:
BDBM72328
Synonyms:
(Z)-3-(4-chlorophenyl)-2-(4-keto-5,6-dimethyl-3H-thieno[2,3-d]pyrimidin-2-yl)acrylic acid ethyl ester MLS000417005 cid_6377798 ethyl (Z)-3-(4-chlorophenyl)-2-(5,6-dimethyl-4-oxo-3H-thieno[2,3-d]pyrimidin-2-yl)prop-2-enoate
Type:
Small organic molecule
Emp. Form.:
C19H17ClN2O3S
Mol. Mass.:
388.868
SMILES:
CCOC(=O)C(=Cc1ccc(Cl)cc1)c1nc2sc(C)c(C)c2c(=O)[nH]1
: