Target
Heat shock factor protein 1
Ligand
BDBM72487
Substrate
Meas. Tech.
Luminescence Cell-Based Dose Retest to Identify Potentiators of Heat Shock Factor 1 (HSF1)
EC50
>260000±n/a nM
Citation
 PubChem, PC Luminescence Cell-Based Dose Retest to Identify Potentiators of Heat Shock Factor 1 (HSF1) PubChem Bioassay (2010)[AID] 
Target
Name:
Heat shock factor protein 1
Synonyms:
HSF1_MOUSE Hsf1 protein
Type:
Enzyme Catalytic Domain
Mol. Mass.:
57208.68
Organism:
Mus musculus
Description:
P38532
Residue:
525
  
Inhibitor
Name:
BDBM72487
Synonyms:
MLS000733547 [1-(1-benzofuran-2-ylmethyl)-4-[[3-(trifluoromethyl)phenyl]methyl]piperidin-4-yl]methanol [1-(benzofuran-2-ylmethyl)-4-[3-(trifluoromethyl)benzyl]-4-piperidyl]methanol {1-(1-benzofuran-2-ylmethyl)-4-[3-(trifluoromethyl)benzyl]piperidin-4-yl}methanol
Type:
Small organic molecule
Emp. Form.:
C23H24F3NO2
Mol. Mass.:
403.4374
SMILES:
OCC1(Cc2cccc(c2)C(F)(F)F)CCN(Cc2cc3ccccc3o2)CC1
: