Target
Protein RecA
Ligand
BDBM56996
Substrate
Meas. Tech.
Fluorescence Cell-Free Homogeneous Dose Retest to Identify Inhibitors of RecA-Intein Splicing Activity
EC50
>380000±n/a nM
Citation
 PubChem, PC Fluorescence Cell-Free Homogeneous Dose Retest to Identify Inhibitors of RecA-Intein Splicing Activity PubChem Bioassay (2010)[AID] 
Target
Name:
Protein RecA
Synonyms:
DNA recombination protein RecA recA
Type:
Enzyme Catalytic Domain
Mol. Mass.:
85386.52
Organism:
Mycobacterium tuberculosis H37Rv
Description:
gi_15609874
Residue:
790
  
Inhibitor
Name:
BDBM56996
Synonyms:
1-(4-imidazol-1-yl-6-phenyl-1,3,5-triazin-2-yl)azepane 1-[4-(1-imidazolyl)-6-phenyl-1,3,5-triazin-2-yl]azepane MLS000043957 cid_1266902
Type:
Small organic molecule
Emp. Form.:
C18H20N6
Mol. Mass.:
320.3916
SMILES:
C1CCCN(CC1)c1nc(nc(n1)-n1ccnc1)-c1ccccc1
: