Target
Protein LANA1
Ligand
BDBM74260
Substrate
Meas. Tech.
Fluorescence Polarization Cell-Free Homogeneous Dose Retest to Confirm Inhibitors of the LANA Histone H2A/H2B Interaction
EC50
>75000±n/a nM
Citation
 PubChem, PC Fluorescence Polarization Cell-Free Homogeneous Dose Retest to Confirm Inhibitors of the LANA Histone H2A/H2B Interaction PubChem Bioassay (2010)[AID] 
Target
Name:
Protein LANA1
Synonyms:
LANA LANA1_HHV8P
Type:
Enzyme Catalytic Domain
Mol. Mass.:
131093.36
Organism:
Human herpesvirus 8
Description:
Q9QR71
Residue:
1129
  
Inhibitor
Name:
BDBM74260
Synonyms:
DIPHEMANIL METHYLSULFATE MLS002154192 SMR001233482 | cid_6126
Type:
Small organic molecule
Emp. Form.:
C20H24N
Mol. Mass.:
278.4107
SMILES:
[#6][N+]1([#6])[#6]-[#6]\[#6](-[#6]-[#6]1)=[#6](\c1ccccc1)-c1ccccc1
: