Target
Importin subunit alpha-1
Ligand
BDBM74671
Substrate
Meas. Tech.
Fluorescence Cell-Free Homogeneous Counterscreen to Identify Inhibitors of the RanGTP-Importin-beta complex.
EC50
>500000±n/a nM
Citation
 PubChem, PC Fluorescence Cell-Free Homogeneous Counterscreen to Identify Inhibitors of the RanGTP-Importin-beta complex. PubChem Bioassay (2010)[AID] 
Target
Name:
Importin subunit alpha-1
Synonyms:
IMA1_HUMAN RCH1 karyopherin alpha 2 (RAG cohort 1, importin alpha 1), isoform CRA_b
Type:
Enzyme Catalytic Domain
Mol. Mass.:
57852.15
Organism:
Homo sapiens (Human)
Description:
gi_119609447
Residue:
529
  
Inhibitor
Name:
BDBM74671
Synonyms:
(4-amino-6-morpholino-s-triazin-2-yl)-diphenyl-amine 6-morpholin-4-yl-2-N,2-N-diphenyl-1,3,5-triazine-2,4-diamine MLS000115799 cid_709348
Type:
Small organic molecule
Emp. Form.:
C19H20N6O
Mol. Mass.:
348.4017
SMILES:
Nc1nc(nc(n1)N1CCOCC1)N(c1ccccc1)c1ccccc1
: