Target
Importin subunit alpha-1
Ligand
BDBM51117
Substrate
Meas. Tech.
Fluorescence Cell-Free Homogeneous Counterscreen to Identify Inhibitors of the RanGTP-Importin-beta complex.
EC50
>500000±n/a nM
Citation
 PubChem, PC Fluorescence Cell-Free Homogeneous Counterscreen to Identify Inhibitors of the RanGTP-Importin-beta complex. PubChem Bioassay (2010)[AID] 
Target
Name:
Importin subunit alpha-1
Synonyms:
IMA1_HUMAN RCH1 karyopherin alpha 2 (RAG cohort 1, importin alpha 1), isoform CRA_b
Type:
Enzyme Catalytic Domain
Mol. Mass.:
57852.15
Organism:
Homo sapiens (Human)
Description:
gi_119609447
Residue:
529
  
Inhibitor
Name:
BDBM51117
Synonyms:
(5E)-5-[[1-(4-methoxyphenyl)-2,5-dimethyl-3-pyrrolyl]methylidene]-3-methyl-2-sulfanylidene-4-thiazolidinone (5E)-5-[[1-(4-methoxyphenyl)-2,5-dimethyl-pyrrol-3-yl]methylidene]-3-methyl-2-sulfanylidene-1,3-thiazolidin-4-one 5-{[1-(4-methoxyphenyl)-2,5-dimethyl-1H-pyrrol-3-yl]methylene}-3-methyl-2-thioxo-1,3-thiazolidin-4-one SMR000270594 | cid_1321364
Type:
Small organic molecule
Emp. Form.:
C18H18N2O2S2
Mol. Mass.:
358.478
SMILES:
COc1ccc(cc1)-n1c(C)cc(\C=C2\SC(=S)N(C)C2=O)c1C
: