Target
Aryl hydrocarbon receptor
Ligand
BDBM75449
Substrate
Meas. Tech.
Luminescence-based cell-based high throughput dose response assay for activators of the Aryl Hydrocarbon Receptor (AHR)
EC50
458.05±n/a nM
Citation
 PubChem, PC Luminescence-based cell-based high throughput dose response assay for activators of the Aryl Hydrocarbon Receptor (AHR) PubChem Bioassay (2010)[AID] 
Target
Name:
Aryl hydrocarbon receptor
Synonyms:
AHR BHLHE76 aryl hydrocarbon receptor precursor
Type:
PROTEIN
Mol. Mass.:
96143.77
Organism:
Homo sapiens (Human)
Description:
ChEMBL_1503828
Residue:
848
  
Inhibitor
Name:
BDBM75449
Synonyms:
MLS000041272 N-(1,7-dimethylpyrazolo[3,4-b]quinolin-3-yl)butanamide SMR000046425 | cid_665305
Type:
Small organic molecule
Emp. Form.:
C16H18N4O
Mol. Mass.:
282.3403
SMILES:
CCCC(=O)Nc1nn(C)c2nc3cc(C)ccc3cc12
: