Target
Insulin-degrading enzyme
Ligand
BDBM50977
Substrate
Meas. Tech.
Dose Response: Fluorescence polarization-based cell-based high throughput dose response assay for inhibitors of insulin-degrading enzyme (IDE)
IC50
>55947±n/a nM
Citation
 PubChem, PC Dose Response: Fluorescence polarization-based cell-based high throughput dose response assay for inhibitors of insulin-degrading enzyme (IDE) PubChem Bioassay (2010)[AID] 
Target
Name:
Insulin-degrading enzyme
Synonyms:
Abeta-degrading protease IDE Insulin degrading enzyme (hIDE) Insulin-degrading enzyme Insulysin | insulin-degrading enzyme isoform 1 precursor
Type:
Enzyme Catalytic Domain
Mol. Mass.:
117968.59
Organism:
Homo sapiens (Human)
Description:
P14735
Residue:
1019
  
Inhibitor
Name:
BDBM50977
Synonyms:
(5Z)-3-(2-furanylmethyl)-5-[[1-(4-methoxyphenyl)-2,5-dimethyl-3-pyrrolyl]methylidene]-2-sulfanylidene-4-thiazolidinone (5Z)-3-(furan-2-ylmethyl)-5-[[1-(4-methoxyphenyl)-2,5-dimethyl-pyrrol-3-yl]methylidene]-2-sulfanylidene-1,3-thiazolidin-4-one 3-(2-furylmethyl)-5-{[1-(4-methoxyphenyl)-2,5-dimethyl-1H-pyrrol-3-yl]methylene}-2-thioxo-1,3-thiazolidin-4-one SMR000198477 | cid_1310155
Type:
Small organic molecule
Emp. Form.:
C22H20N2O3S2
Mol. Mass.:
424.536
SMILES:
COc1ccc(cc1)-n1c(C)cc(\C=C2/SC(=S)N(Cc3ccco3)C2=O)c1C
: