Target
Apelin receptor
Ligand
BDBM76137
Substrate
Meas. Tech.
Dose Response confirmation of uHTS hits from a small molecule agonists of the APJ receptor via a luminescent beta-arrestin assay
EC50
>100000±n/a nM
Citation
 PubChem, PC Dose Response confirmation of uHTS hits from a small molecule agonists of the APJ receptor via a luminescent beta-arrestin assay PubChem Bioassay (2010)[AID] 
Target
Name:
Apelin receptor
Synonyms:
AGTRL1 APJ_HUMAN Angiotensin receptor-like 1 Apelin receptor (APJ) G-protein coupled receptor HG11
Type:
Enzyme Catalytic Domain
Mol. Mass.:
42664.06
Organism:
Homo sapiens (Human)
Description:
P35414
Residue:
380
  
Inhibitor
Name:
BDBM76137
Synonyms:
MLS001125520 N-[(3,5-dimethoxyphenyl)carbamothioyl]-3-phenyl-propanamide N-[(3,5-dimethoxyphenyl)thiocarbamoyl]-3-phenyl-propionamide cid_1302084
Type:
Small organic molecule
Emp. Form.:
C18H20N2O3S
Mol. Mass.:
344.428
SMILES:
COc1cc(NC(=S)NC(=O)CCc2ccccc2)cc(OC)c1
: