Target
Voltage-dependent T-type calcium channel subunit alpha-1H
Ligand
BDBM76829
Substrate
Meas. Tech.
Inhibitors of T-Type Calcium Channel
EC50
4070±0 nM
Citation
 PubChem, PC Inhibitors of T-Type Calcium Channel PubChem Bioassay (2010)[AID] 
Target
Name:
Voltage-dependent T-type calcium channel subunit alpha-1H
Synonyms:
CAC1H_HUMAN Low-voltage-activated calcium channel alpha1 3.2 subunit Voltage-gated calcium channel voltage-dependent T-type calcium channel subunit alpha-1H isoform a
Type:
Enzyme Catalytic Domain
Mol. Mass.:
259187.68
Organism:
Homo sapiens (Human)
Description:
Calcium channel (Type T,L) 0 0::O95180
Residue:
2353
  
Inhibitor
Name:
BDBM76829
Synonyms:
MLS000027133 N,N'-bis[1-(2,3-dihydro-1,4-benzodioxin-3-yl)ethyl]butanediamide SMR000009442 | cid_650120
Type:
Small organic molecule
Emp. Form.:
C24H28N2O6
Mol. Mass.:
440.4889
SMILES:
CC(NC(=O)CCC(=O)NC(C)C1COc2ccccc2O1)C1COc2ccccc2O1
: