Target
Voltage-dependent T-type calcium channel subunit alpha-1H
Ligand
BDBM77067
Substrate
Meas. Tech.
Inhibitors of T-Type Calcium Channel
EC50
4060±0 nM
Citation
 PubChem, PC Inhibitors of T-Type Calcium Channel PubChem Bioassay (2010)[AID] 
Target
Name:
Voltage-dependent T-type calcium channel subunit alpha-1H
Synonyms:
CAC1H_HUMAN Low-voltage-activated calcium channel alpha1 3.2 subunit Voltage-gated calcium channel voltage-dependent T-type calcium channel subunit alpha-1H isoform a
Type:
Enzyme Catalytic Domain
Mol. Mass.:
259187.68
Organism:
Homo sapiens (Human)
Description:
Calcium channel (Type T,L) 0 0::O95180
Residue:
2353
  
Inhibitor
Name:
BDBM77067
Synonyms:
2-[2-(2-methylpiperidin-1-yl)-2-oxidanylidene-ethyl]sulfanyl-N-(4-thiophen-2-yl-1,3-thiazol-2-yl)ethanamide 2-[[2-(2-methyl-1-piperidinyl)-2-oxoethyl]thio]-N-(4-thiophen-2-yl-2-thiazolyl)acetamide MLS000101009 cid_4155687
Type:
Small organic molecule
Emp. Form.:
C17H21N3O2S3
Mol. Mass.:
395.563
SMILES:
CC1CCCCN1C(=O)CSCC(=O)Nc1nc(cs1)-c1cccs1
: