Target
Voltage-dependent T-type calcium channel subunit alpha-1H
Ligand
BDBM77148
Substrate
Meas. Tech.
Inhibitors of T-Type Calcium Channel
EC50
5320±0 nM
Citation
 PubChem, PC Inhibitors of T-Type Calcium Channel PubChem Bioassay (2010)[AID] 
Target
Name:
Voltage-dependent T-type calcium channel subunit alpha-1H
Synonyms:
CAC1H_HUMAN Low-voltage-activated calcium channel alpha1 3.2 subunit Voltage-gated calcium channel voltage-dependent T-type calcium channel subunit alpha-1H isoform a
Type:
Enzyme Catalytic Domain
Mol. Mass.:
259187.68
Organism:
Homo sapiens (Human)
Description:
Calcium channel (Type T,L) 0 0::O95180
Residue:
2353
  
Inhibitor
Name:
BDBM77148
Synonyms:
4-[4-(3-Methoxy-phenyl)-thiazol-2-yl]-piperazine-1-carboxylic acid adamantan-1-ylamide N-(1-adamantyl)-4-[4-(3-methoxyphenyl)-1,3-thiazol-2-yl]piperazine-1-carboxamide N-(1-adamantyl)-4-[4-(3-methoxyphenyl)thiazol-2-yl]piperazine-1-carboxamide cid_3223832
Type:
Small organic molecule
Emp. Form.:
C25H32N4O2S
Mol. Mass.:
452.612
SMILES:
[H]C12CC3([H])CC([H])(C1)CC(C2)(C3)NC(=O)N1CCN(CC1)c1nc(cs1)-c1cccc(OC)c1
: