Target
Mitochondrial import inner membrane translocase subunit TIM10
Ligand
BDBM59704
Substrate
Meas. Tech.
Dose Response confirmation of uHTS small molecule inhibitors of tim10-1 yeast via a luminescent assay
IC50
43100±n/a nM
Citation
 PubChem, PC Dose Response confirmation of uHTS small molecule inhibitors of tim10-1 yeast via a luminescent assay PubChem Bioassay (2010)[AID] 
Target
Name:
Mitochondrial import inner membrane translocase subunit TIM10
Synonyms:
MRS11 TIM10_YEAST TPA: Essential protein of the mitochondrial intermembrane space, forms a complex with Tim9p (TIM10 complex) that delivers hydrophobic proteins to the TIM22 complex for insertion into the inner ...
Type:
Enzyme Catalytic Domain
Mol. Mass.:
10303.50
Organism:
Saccharomyces cerevisiae S288c
Description:
gi_285809906
Residue:
93
  
Inhibitor
Name:
BDBM59704
Synonyms:
1-(3,4-dichlorophenyl)-3-[4-[(3,4-dimethyl-1,2-oxazol-5-yl)sulfamoyl]phenyl]urea 1-(3,4-dichlorophenyl)-3-[4-[(3,4-dimethylisoxazol-5-yl)sulfamoyl]phenyl]urea MLS000050956 cid_1188014
Type:
Small organic molecule
Emp. Form.:
C18H16Cl2N4O4S
Mol. Mass.:
455.315
SMILES:
Cc1noc(NS(=O)(=O)c2ccc(NC(=O)Nc3ccc(Cl)c(Cl)c3)cc2)c1C
: