Target
Mitochondrial import inner membrane translocase subunit TIM10
Ligand
BDBM78299
Substrate
Meas. Tech.
Dose Response confirmation of uHTS small molecule inhibitors of tim10-1 yeast via a luminescent assay
IC50
16700±n/a nM
Citation
 PubChem, PC Dose Response confirmation of uHTS small molecule inhibitors of tim10-1 yeast via a luminescent assay PubChem Bioassay (2010)[AID] 
Target
Name:
Mitochondrial import inner membrane translocase subunit TIM10
Synonyms:
MRS11 TIM10_YEAST TPA: Essential protein of the mitochondrial intermembrane space, forms a complex with Tim9p (TIM10 complex) that delivers hydrophobic proteins to the TIM22 complex for insertion into the inner ...
Type:
Enzyme Catalytic Domain
Mol. Mass.:
10303.50
Organism:
Saccharomyces cerevisiae S288c
Description:
gi_285809906
Residue:
93
  
Inhibitor
Name:
BDBM78299
Synonyms:
3-(4-methoxyphenyl)-4H-pyrazol-4-one N-phenylhydrazone N-[(E)-[3-(4-methoxyphenyl)-4-pyrazolylidene]amino]aniline SMR000334641 cid_6367769
Type:
Small organic molecule
Emp. Form.:
C16H14N4O
Mol. Mass.:
278.3086
SMILES:
COc1ccc(cc1)-c1n[nH]cc1N=Nc1ccccc1
: