Target
Voltage-dependent T-type calcium channel subunit alpha-1H
Ligand
BDBM37138
Substrate
Meas. Tech.
Inhibitors of T-Type Calcium Channels
EC50
4615±n/a nM
Citation
 PubChem, PC Inhibitors of T-Type Calcium Channels PubChem Bioassay (2011)[AID] 
Target
Name:
Voltage-dependent T-type calcium channel subunit alpha-1H
Synonyms:
CAC1H_HUMAN Low-voltage-activated calcium channel alpha1 3.2 subunit Voltage-gated calcium channel voltage-dependent T-type calcium channel subunit alpha-1H isoform a
Type:
Enzyme Catalytic Domain
Mol. Mass.:
259187.68
Organism:
Homo sapiens (Human)
Description:
Calcium channel (Type T,L) 0 0::O95180
Residue:
2353
  
Inhibitor
Name:
BDBM37138
Synonyms:
6-(4-methyl-1-piperazinyl)-2-(8-methyl-5-quinolinyl)-1H-benzo[de]isoquinoline-1,3(2H)-dione 6-(4-methylpiperazin-1-yl)-2-(8-methylquinolin-5-yl)benzo[de]isoquinoline-1,3-dione MLS000089012 cid_2193273
Type:
Small organic molecule
Emp. Form.:
C27H24N4O2
Mol. Mass.:
436.5051
SMILES:
CN1CCN(CC1)c1ccc2C(=O)N(C(=O)c3cccc1c23)c1ccc(C)c2ncccc12
: