Target
X-box-binding protein 1
Ligand
BDBM30762
Substrate
Meas. Tech.
XBP1 DR counterscreen for CHOP
IC50
10000±n/a nM
Citation
 PubChem, PC XBP1 DR counterscreen for CHOP PubChem Bioassay (2011)[AID] 
Target
Name:
X-box-binding protein 1
Synonyms:
TREB5 XBP1_HUMAN | XBP2
Type:
Enzyme Catalytic Domain
Mol. Mass.:
28704.14
Organism:
Homo sapiens (Human)
Description:
gi_47678753
Residue:
261
  
Inhibitor
Name:
BDBM30762
Synonyms:
2-amino-N-butan-2-yl-1-(2-oxolanylmethyl)-3-pyrrolo[3,2-b]quinoxalinecarboxamide 2-amino-N-sec-butyl-1-(tetrahydrofurfuryl)pyrrolo[3,2-b]quinoxaline-3-carboxamide MLS000040979 cid_662288
Type:
Small organic molecule
Emp. Form.:
C20H25N5O2
Mol. Mass.:
367.4448
SMILES:
CCC(C)NC(=O)c1c(N)n(CC2CCCO2)c2nc3ccccc3nc12
: