Target
X-box-binding protein 1
Ligand
BDBM49387
Substrate
Meas. Tech.
XBP1 DR counterscreen for CHOP
IC50
310±n/a nM
Citation
 PubChem, PC XBP1 DR counterscreen for CHOP PubChem Bioassay (2011)[AID] 
Target
Name:
X-box-binding protein 1
Synonyms:
TREB5 XBP1_HUMAN | XBP2
Type:
Enzyme Catalytic Domain
Mol. Mass.:
28704.14
Organism:
Homo sapiens (Human)
Description:
gi_47678753
Residue:
261
  
Inhibitor
Name:
BDBM49387
Synonyms:
3-[(4-methoxyphenoxy)methyl]-N-(4-nitro-1-pyrazolyl)benzamide MLS000547843 SMR000115056 | cid_4766173
Type:
Small organic molecule
Emp. Form.:
C18H16N4O5
Mol. Mass.:
368.3434
SMILES:
COc1ccc(OCc2cccc(c2)C(=O)Nn2cc(cn2)[N+]([O-])=O)cc1
: