Target
X-box-binding protein 1
Ligand
BDBM41816
Substrate
Meas. Tech.
XBP1 DR counterscreen for CHOP
IC50
270±n/a nM
Citation
 PubChem, PC XBP1 DR counterscreen for CHOP PubChem Bioassay (2011)[AID] 
Target
Name:
X-box-binding protein 1
Synonyms:
TREB5 XBP1_HUMAN | XBP2
Type:
Enzyme Catalytic Domain
Mol. Mass.:
28704.14
Organism:
Homo sapiens (Human)
Description:
gi_47678753
Residue:
261
  
Inhibitor
Name:
BDBM41816
Synonyms:
(NE)-N-[3-(2,4-dimethylanilino)-4-keto-1-naphthylidene]thiophene-2-sulfonamide (NE)-N-[3-(2,4-dimethylanilino)-4-oxonaphthalen-1-ylidene]thiophene-2-sulfonamide MLS000549894 SMR000113727 | cid_9549688
Type:
Small organic molecule
Emp. Form.:
C22H18N2O3S2
Mol. Mass.:
422.52
SMILES:
Cc1ccc(NC2=CC(=NS(=O)(=O)c3cccs3)c3ccccc3C2=O)c(C)c1
: