Target
X-box-binding protein 1
Ligand
BDBM67806
Substrate
Meas. Tech.
XBP1 DR counterscreen for CHOP
IC50
160±n/a nM
Citation
 PubChem, PC XBP1 DR counterscreen for CHOP PubChem Bioassay (2011)[AID] 
Target
Name:
X-box-binding protein 1
Synonyms:
TREB5 XBP1_HUMAN | XBP2
Type:
Enzyme Catalytic Domain
Mol. Mass.:
28704.14
Organism:
Homo sapiens (Human)
Description:
gi_47678753
Residue:
261
  
Inhibitor
Name:
BDBM67806
Synonyms:
5-(3-fluorobenzyl)-7-(trifluoromethyl)-3,3a-dihydro-1H-thiazolo[3,4-a]quinoxalin-4-one 5-[(3-fluorophenyl)methyl]-7-(trifluoromethyl)-3,3a-dihydro-1H-[1,3]thiazolo[3,4-a]quinoxalin-4-one MLS000541394 cid_3743081
Type:
Small organic molecule
Emp. Form.:
C18H14F4N2OS
Mol. Mass.:
382.375
SMILES:
Fc1cccc(CN2C(=O)C3CSCN3c3ccc(cc23)C(F)(F)F)c1
: