Target
X-box-binding protein 1
Ligand
BDBM68025
Substrate
Meas. Tech.
XBP1 DR counterscreen for CHOP
IC50
160±n/a nM
Citation
 PubChem, PC XBP1 DR counterscreen for CHOP PubChem Bioassay (2011)[AID] 
Target
Name:
X-box-binding protein 1
Synonyms:
TREB5 XBP1_HUMAN | XBP2
Type:
Enzyme Catalytic Domain
Mol. Mass.:
28704.14
Organism:
Homo sapiens (Human)
Description:
gi_47678753
Residue:
261
  
Inhibitor
Name:
BDBM68025
Synonyms:
2-(5-amyl-2-keto-tetrahydrofuran-3-yl)-N-(4-nitrophenyl)acetamide N-(4-Nitro-phenyl)-2-(2-oxo-5-pentyl-tetrahydro-furan-3-yl)-acetamide N-(4-nitrophenyl)-2-(2-oxo-5-pentyl-3-oxolanyl)acetamide SMR000211156 | cid_3648665
Type:
Small organic molecule
Emp. Form.:
C17H22N2O5
Mol. Mass.:
334.367
SMILES:
CCCCCC1CC(CC(=O)Nc2ccc(cc2)[N+]([O-])=O)C(=O)O1
: