Target
X-box-binding protein 1
Ligand
BDBM61626
Substrate
Meas. Tech.
XBP1 DR counterscreen for CHOP
IC50
330±n/a nM
Citation
 PubChem, PC XBP1 DR counterscreen for CHOP PubChem Bioassay (2011)[AID] 
Target
Name:
X-box-binding protein 1
Synonyms:
TREB5 XBP1_HUMAN | XBP2
Type:
Enzyme Catalytic Domain
Mol. Mass.:
28704.14
Organism:
Homo sapiens (Human)
Description:
gi_47678753
Residue:
261
  
Inhibitor
Name:
BDBM61626
Synonyms:
MLS000777252 N-(4-hydroxyphenyl)-4-[(5Z)-4-keto-5-(4-methylbenzylidene)-2-thioxo-thiazolidin-3-yl]butyramide N-(4-hydroxyphenyl)-4-[(5Z)-5-[(4-methylphenyl)methylidene]-4-oxo-2-sulfanylidene-1,3-thiazolidin-3-yl]butanamide SMR000413647 | cid_1346847
Type:
Small organic molecule
Emp. Form.:
C21H20N2O3S2
Mol. Mass.:
412.525
SMILES:
Cc1ccc(\C=C2/SC(=S)N(CCCC(=O)Nc3ccc(O)cc3)C2=O)cc1
: