Target
DNA damage-inducible transcript 3 protein
Ligand
BDBM41816
Substrate
Meas. Tech.
CHOP dose-response primary assay
IC50
4400±n/a nM
Citation
 PubChem, PC CHOP dose-response primary assay PubChem Bioassay (2011)[AID] 
Target
Name:
DNA damage-inducible transcript 3 protein
Synonyms:
Chop DDIT3_MOUSE Gadd153
Type:
Enzyme Catalytic Domain
Mol. Mass.:
19175.17
Organism:
Mus musculus
Description:
gi_160707929
Residue:
168
  
Inhibitor
Name:
BDBM41816
Synonyms:
(NE)-N-[3-(2,4-dimethylanilino)-4-keto-1-naphthylidene]thiophene-2-sulfonamide (NE)-N-[3-(2,4-dimethylanilino)-4-oxonaphthalen-1-ylidene]thiophene-2-sulfonamide MLS000549894 SMR000113727 | cid_9549688
Type:
Small organic molecule
Emp. Form.:
C22H18N2O3S2
Mol. Mass.:
422.52
SMILES:
Cc1ccc(NC2=CC(=NS(=O)(=O)c3cccs3)c3ccccc3C2=O)c(C)c1
: