Target
Neurotensin receptor type 1
Ligand
BDBM66003
Substrate
Meas. Tech.
Dose Response confirmation of Image-Based HTS for Selective Agonists for NTR1
EC50
12600±n/a nM
Citation
 PubChem, PC Dose Response confirmation of Image-Based HTS for Selective Agonists for NTR1 PubChem Bioassay (2011)[AID] 
Target
Name:
Neurotensin receptor type 1
Synonyms:
Dopamine receptor D2L/neurotensin receptor NTS1 NTRR Neurotensin receptor 1 | neurotensin receptor type 1
Type:
PROTEIN
Mol. Mass.:
46278.89
Organism:
Homo sapiens (Human)
Description:
ChEMBL_1453811
Residue:
418
  
Inhibitor
Name:
BDBM66003
Synonyms:
(5E)-1-(4-fluorobenzyl)-5-(2-thenylidene)barbituric acid 1-(4-Fluoro-benzyl)-5-[1-thiophen-2-yl-meth-(E)-ylidene]-pyrimidine-2,4,6-trione SMR000218269 | cid_5418979
Type:
Small organic molecule
Emp. Form.:
C16H11FN2O3S
Mol. Mass.:
330.334
SMILES:
Fc1ccc(CN2C(=O)NC(=O)\C(=C/c3cccs3)C2=O)cc1
: