Target
Orexin/Hypocretin receptor type 1
Ligand
BDBM37361
Substrate
Meas. Tech.
Fluorescence-based cell-based high throughput dose response assay for antagonists of the orexin 1 receptor (OX1R; HCRTR1)
IC50
23563±n/a nM
Citation
 PubChem, PC Fluorescence-based cell-based high throughput dose response assay for antagonists of the orexin 1 receptor (OX1R; HCRTR1) PubChem Bioassay (2011)[AID] 
Target
Name:
Orexin/Hypocretin receptor type 1
Synonyms:
HCRTR1 OX1R_HUMAN Orexin receptor type 1 (OR 1) Orexin receptor type 1 (OX1) Orexin receptor type 1 (OxR1) | Ox1r
Type:
Protein
Mol. Mass.:
47554.50
Organism:
Homo sapiens (Human)
Description:
O43613
Residue:
425
  
Inhibitor
Name:
BDBM37361
Synonyms:
8-[2-(4-Methoxy-phenyl)-5-phenyl-pyrazolo[1,5-a]pyrimidin-7-yl]-1,4-dioxa-8-aza-spiro[4.5]decane 8-[2-(4-methoxyphenyl)-5-phenyl-pyrazolo[1,5-a]pyrimidin-7-yl]-1,4-dioxa-8-azaspiro[4.5]decane MLS000035341 cid_650554
Type:
Small organic molecule
Emp. Form.:
C26H26N4O3
Mol. Mass.:
442.5096
SMILES:
COc1ccc(cc1)-c1cc2nc(cc(N3CCC4(CC3)OCCO4)n2n1)-c1ccccc1
: