Target
Orexin/Hypocretin receptor type 1
Ligand
BDBM79829
Substrate
Meas. Tech.
Homogeneous Time Resolved Fluorescence (HTRF)-based cell-based high throughput dose response assay for antagonists of the orexin 1 receptor (OX1R; HCRTR1)
IC50
6664±n/a nM
Citation
 PubChem, PC Homogeneous Time Resolved Fluorescence (HTRF)-based cell-based high throughput dose response assay for antagonists of the orexin 1 receptor (OX1R; HCRTR1) PubChem Bioassay (2011)[AID] 
Target
Name:
Orexin/Hypocretin receptor type 1
Synonyms:
HCRTR1 OX1R_HUMAN Orexin receptor type 1 (OR 1) Orexin receptor type 1 (OX1) Orexin receptor type 1 (OxR1) | Ox1r
Type:
Protein
Mol. Mass.:
47554.50
Organism:
Homo sapiens (Human)
Description:
O43613
Residue:
425
  
Inhibitor
Name:
BDBM79829
Synonyms:
2-(4-Ethyl-5-thiophen-2-yl-4H-[1,2,4]triazol-3-ylsulfanyl)-1-naphthalen-2-yl-ethanone 2-[(4-ethyl-5-thiophen-2-yl-1,2,4-triazol-3-yl)sulfanyl]-1-naphthalen-2-ylethanone 2-[[4-ethyl-5-(2-thienyl)-1,2,4-triazol-3-yl]thio]-1-(2-naphthyl)ethanone SMR000148725 | cid_4438402
Type:
Small organic molecule
Emp. Form.:
C20H17N3OS2
Mol. Mass.:
379.498
SMILES:
CCn1c(SCC(=O)c2ccc3ccccc3c2)nnc1-c1cccs1
: