Target
Beta-galactosidase
Ligand
BDBM41816
Substrate
Meas. Tech.
HTS Dose response counterscreen for assays utilizing the enzyme, beta-galactosidase - Set 3
IC50
>66600±0 nM
Citation
 PubChem, PC HTS Dose response counterscreen for assays utilizing the enzyme, beta-galactosidase - Set 3 PubChem Bioassay (2011)[AID] 
Target
Name:
Beta-galactosidase
Synonyms:
BGAL_ECOLX Lactase | lacZ
Type:
PROTEIN
Mol. Mass.:
116943.87
Organism:
Escherichia coli
Description:
ChEMBL_215882
Residue:
1029
  
Inhibitor
Name:
BDBM41816
Synonyms:
(NE)-N-[3-(2,4-dimethylanilino)-4-keto-1-naphthylidene]thiophene-2-sulfonamide (NE)-N-[3-(2,4-dimethylanilino)-4-oxonaphthalen-1-ylidene]thiophene-2-sulfonamide MLS000549894 SMR000113727 | cid_9549688
Type:
Small organic molecule
Emp. Form.:
C22H18N2O3S2
Mol. Mass.:
422.52
SMILES:
Cc1ccc(NC2=CC(=NS(=O)(=O)c3cccs3)c3ccccc3C2=O)c(C)c1
: