Target
Beta-galactosidase
Ligand
BDBM51326
Substrate
Meas. Tech.
HTS Dose response counterscreen for assays utilizing the enzyme, beta-galactosidase - Set 3
IC50
>66600±0 nM
Citation
 PubChem, PC HTS Dose response counterscreen for assays utilizing the enzyme, beta-galactosidase - Set 3 PubChem Bioassay (2011)[AID] 
Target
Name:
Beta-galactosidase
Synonyms:
BGAL_ECOLX Lactase | lacZ
Type:
PROTEIN
Mol. Mass.:
116943.87
Organism:
Escherichia coli
Description:
ChEMBL_215882
Residue:
1029
  
Inhibitor
Name:
BDBM51326
Synonyms:
1-(3,5-dimethylphenyl)-3-(1-phenyltetrazol-5-yl)sulfanylpyrrolidine-2,5-dione 1-(3,5-dimethylphenyl)-3-[(1-phenyl-1H-tetrazol-5-yl)thio]-2,5-pyrrolidinedione 1-(3,5-dimethylphenyl)-3-[(1-phenyltetrazol-5-yl)thio]pyrrolidine-2,5-quinone SMR000198093 | cid_2936558
Type:
Small organic molecule
Emp. Form.:
C19H17N5O2S
Mol. Mass.:
379.436
SMILES:
Cc1cc(C)cc(c1)-n1c(O)cc(Sc2nnnn2-c2ccccc2)c1O
: